Target
Beta-secretase 1
Ligand
BDBM50231484
Substrate
Meas. Tech.
ChEMBL_462005 (CHEMBL944848)
IC50
1300±n/a nM
Citation
 Cole, DCStock, JRChopra, RCowling, REllingboe, JWFan, KYHarrison, BLHu, YJacobsen, SJennings, LDJin, GLohse, PAMalamas, MSManas, ESMoore, WJO'Donnell, MMOlland, AMRobichaud, AJSvenson, KWu, JWagner, EBard, J Acylguanidine inhibitors of beta-secretase: optimization of the pyrrole ring substituents extending into the S1 and S3 substrate binding pockets. Bioorg Med Chem Lett 18:1063-6 (2008)  
Target
Name:
Beta-secretase 1
Synonyms:
ASP2 Aspartyl protease 2 BACE1 Beta-secretase (BACE) Beta-secretase 1 (BACE 1) Beta-secretase 1 (BACE1) Beta-site amyloid precursor protein cleaving enzyme 1 Memapsin-2 beta-Secretase (BACE-1) | beta-Secretase (BACE1)
Type:
Protein
Mol. Mass.:
55755.10
Organism:
Homo sapiens (Human)
Description:
P56817
Residue:
501
  
Inhibitor
Name:
BDBM50231484
Synonyms:
CHEMBL252026 | N-{2-[2-[4-(4-acetyl-phenoxy)-phenyl]-5-(4-fluoro-phenyl)-pyrrol-1-yl]-acetyl}-guanidine
Type:
Small organic molecule
Emp. Form.:
C27H23FN4O3
Mol. Mass.:
470.4949
SMILES:
CC(=O)c1ccc(Oc2ccc(cc2)-c2ccc(-c3ccc(F)cc3)n2CC(=O)NC(N)=N)cc1
: