Target
Beta-secretase 1
Ligand
BDBM50231689
Substrate
Meas. Tech.
ChEMBL_462057 (CHEMBL945831)
IC50
83±n/a nM
Citation
 Clarke, BDemont, EDingwall, CDunsdon, RFaller, AHawkins, JHussain, IMacPherson, DMaile, GMatico, RMilner, PMosley, JNaylor, AO'Brien, ARedshaw, SRiddell, DRowland, PSoleil, VSmith, KJStanway, SStemp, GSweitzer, STheobald, PVesey, DWalter, DSWard, JWayne, G BACE-1 inhibitors part 2: identification of hydroxy ethylamines (HEAs) with reduced peptidic character. Bioorg Med Chem Lett 18:1017-21 (2008)  
Target
Name:
Beta-secretase 1
Synonyms:
ASP2 Aspartyl protease 2 BACE1 Beta-secretase (BACE) Beta-secretase 1 (BACE 1) Beta-secretase 1 (BACE1) Beta-site amyloid precursor protein cleaving enzyme 1 Memapsin-2 beta-Secretase (BACE-1) | beta-Secretase (BACE1)
Type:
Protein
Mol. Mass.:
55755.10
Organism:
Homo sapiens (Human)
Description:
P56817
Residue:
501
  
Inhibitor
Name:
BDBM50231689
Synonyms:
CHEMBL253719 | N-((2S,3R)-4-(3-chlorobenzylamino)-3-hydroxy-1-phenylbutan-2-yl)-3-(ethylamino)-5-(2-oxopyrrolidin-1-yl)benzamide
Type:
Small organic molecule
Emp. Form.:
C30H35ClN4O3
Mol. Mass.:
535.077
SMILES:
CCNc1cc(cc(c1)C(=O)N[C@@H](Cc1ccccc1)[C@H](O)CNCc1cccc(Cl)c1)N1CCCC1=O
: