Target
Beta-secretase 1
Ligand
BDBM50231681
Substrate
Meas. Tech.
ChEMBL_462057 (CHEMBL945831)
IC50
1700±n/a nM
Citation
 Clarke, BDemont, EDingwall, CDunsdon, RFaller, AHawkins, JHussain, IMacPherson, DMaile, GMatico, RMilner, PMosley, JNaylor, AO'Brien, ARedshaw, SRiddell, DRowland, PSoleil, VSmith, KJStanway, SStemp, GSweitzer, STheobald, PVesey, DWalter, DSWard, JWayne, G BACE-1 inhibitors part 2: identification of hydroxy ethylamines (HEAs) with reduced peptidic character. Bioorg Med Chem Lett 18:1017-21 (2008)  
Target
Name:
Beta-secretase 1
Synonyms:
ASP2 Aspartyl protease 2 BACE1 Beta-secretase (BACE) Beta-secretase 1 (BACE 1) Beta-secretase 1 (BACE1) Beta-site amyloid precursor protein cleaving enzyme 1 Memapsin-2 beta-Secretase (BACE-1) | beta-Secretase (BACE1)
Type:
Protein
Mol. Mass.:
55755.10
Organism:
Homo sapiens (Human)
Description:
P56817
Residue:
501
  
Inhibitor
Name:
BDBM50231681
Synonyms:
3-(ethylamino)-N-((2S,3R)-3-hydroxy-1-phenyl-4-(phenylamino)butan-2-yl)-5-(2-oxopyrrolidin-1-yl)benzamide | CHEMBL252861
Type:
Small organic molecule
Emp. Form.:
C29H34N4O3
Mol. Mass.:
486.6053
SMILES:
CCNc1cc(cc(c1)C(=O)N[C@@H](Cc1ccccc1)[C@H](O)CNc1ccccc1)N1CCCC1=O
: