Target
Beta-secretase 2
Ligand
BDBM50231679
Substrate
Meas. Tech.
ChEMBL_462058 (CHEMBL945832)
IC50
5890±n/a nM
Citation
 Clarke, BDemont, EDingwall, CDunsdon, RFaller, AHawkins, JHussain, IMacPherson, DMaile, GMatico, RMilner, PMosley, JNaylor, AO'Brien, ARedshaw, SRiddell, DRowland, PSoleil, VSmith, KJStanway, SStemp, GSweitzer, STheobald, PVesey, DWalter, DSWard, JWayne, G BACE-1 inhibitors part 2: identification of hydroxy ethylamines (HEAs) with reduced peptidic character. Bioorg Med Chem Lett 18:1017-21 (2008)  
Target
Name:
Beta-secretase 2
Synonyms:
AEPLC ASP1 Asp 1 Aspartyl protease 1 BACE2_HUMAN Beta-secretase (BACE) Beta-secretase 2 (BACE-2) Beta-site APP-cleaving enzyme 2 Memapsin-1 beta-Secretase (BACE-2)
Type:
Protein
Mol. Mass.:
56171.20
Organism:
Homo sapiens (Human)
Description:
Q9Y5Z0
Residue:
518
  
Inhibitor
Name:
BDBM50231679
Synonyms:
3-(ethylamino)-N-((2S,3R)-3-hydroxy-1-phenyl-4-(tetrahydro-2H-thiopyran-4-ylamino)butan-2-yl)-5-(2-oxopyrrolidin-1-yl)benzamide | CHEMBL252058
Type:
Small organic molecule
Emp. Form.:
C28H38N4O3S
Mol. Mass.:
510.691
SMILES:
CCNc1cc(cc(c1)C(=O)N[C@@H](Cc1ccccc1)[C@H](O)CNC1CCSCC1)N1CCCC1=O
: