Target
Cathepsin D
Ligand
BDBM50231698
Substrate
Meas. Tech.
ChEMBL_462059 (CHEMBL945833)
IC50
1095±n/a nM
Citation
 Clarke, BDemont, EDingwall, CDunsdon, RFaller, AHawkins, JHussain, IMacPherson, DMaile, GMatico, RMilner, PMosley, JNaylor, AO'Brien, ARedshaw, SRiddell, DRowland, PSoleil, VSmith, KJStanway, SStemp, GSweitzer, STheobald, PVesey, DWalter, DSWard, JWayne, G BACE-1 inhibitors part 2: identification of hydroxy ethylamines (HEAs) with reduced peptidic character. Bioorg Med Chem Lett 18:1017-21 (2008)  
Target
Name:
Cathepsin D
Synonyms:
CATD_HUMAN CTSD Cathepsin D heavy chain Cathepsin D precursor
Type:
Enzyme
Mol. Mass.:
44551.72
Organism:
Homo sapiens (Human)
Description:
Human proCathepsin D (SwissProt accession number P07339) was expressed in Sf9 cells, purified, and autoactivated.
Residue:
412
  
Inhibitor
Name:
BDBM50231698
Synonyms:
3-(ethylamino)-N-((2S,3R)-3-hydroxy-4-(6-methylheptan-2-ylamino)-1-phenylbutan-2-yl)-5-(2-oxopyrrolidin-1-yl)benzamide | CHEMBL252263
Type:
Small organic molecule
Emp. Form.:
C31H46N4O3
Mol. Mass.:
522.7219
SMILES:
CCNc1cc(cc(c1)C(=O)N[C@@H](Cc1ccccc1)[C@H](O)CNC(C)CCCC(C)C)N1CCCC1=O
: