Target
Adenosine receptor A2a
Ligand
BDBM21172
Substrate
Meas. Tech.
ChEMBL_460899 (CHEMBL943926)
Ki
2.7±n/a nM
Citation
 Slee, DHZhang, XMoorjani, MLin, ELanier, MCChen, YRueter, JKLechner, SMMarkison, SMalany, SJoswig, TSantos, MGross, RSWilliams, JPCastro-Palomino, JCCrespo, MIPrat, MGual, SDíaz, JLWen, JO'Brien, ZSaunders, J Identification of novel, water-soluble, 2-amino-N-pyrimidin-4-yl acetamides as A2A receptor antagonists with in vivo efficacy. J Med Chem 51:400-6 (2008)  
Target
Name:
Adenosine receptor A2a
Synonyms:
A2A adenosine receptor (hA2A) ADENOSINE A2 ADORA2 Adenosine A2A receptor (A2AAR)
Type:
G Protein-Coupled Receptor (GPCR)
Mol. Mass.:
44716.46
Organism:
Homo sapiens (Human)
Description:
P29274
Residue:
412
  
Inhibitor
Name:
BDBM21172
Synonyms:
CHEMBL251975 Pyrimidine analogue, 1
Type:
Small organic molecule
Emp. Form.:
C18H21N7O2
Mol. Mass.:
367.405
SMILES:
CN1CCN(CC(=O)Nc2cc(nc(n2)-c2ccco2)-n2cccn2)CC1
: