Target
Adenosine receptor A2a
Ligand
BDBM50176050
Substrate
Meas. Tech.
ChEMBL_460899 (CHEMBL943926)
Ki
6±n/a nM
Citation
 Slee, DHZhang, XMoorjani, MLin, ELanier, MCChen, YRueter, JKLechner, SMMarkison, SMalany, SJoswig, TSantos, MGross, RSWilliams, JPCastro-Palomino, JCCrespo, MIPrat, MGual, SDíaz, JLWen, JO'Brien, ZSaunders, J Identification of novel, water-soluble, 2-amino-N-pyrimidin-4-yl acetamides as A2A receptor antagonists with in vivo efficacy. J Med Chem 51:400-6 (2008)  
Target
Name:
Adenosine receptor A2a
Synonyms:
A2A adenosine receptor (hA2A) ADENOSINE A2 ADORA2 Adenosine A2A receptor (A2AAR)
Type:
G Protein-Coupled Receptor (GPCR)
Mol. Mass.:
44716.46
Organism:
Homo sapiens (Human)
Description:
P29274
Residue:
412
  
Inhibitor
Name:
BDBM50176050
Synonyms:
8-(3,4-dimethoxystyryl)-1,3-diethyl-7-methyl-1H-purine-2,6(3H,7H)-dione 8-[2-(3,4-dimethoxy-phenyl)-vinyl]-1,3-diethyl-7-methyl-3,9-dihydro-purine-2,6-dione US11806350, Compound Istradefylline | istradefylline
Type:
Small organic molecule
Emp. Form.:
C20H24N4O4
Mol. Mass.:
384.429
SMILES:
CCn1c2nc(\C=C\c3ccc(OC)c(OC)c3)n(C)c2c(=O)n(CC)c1=O
: