Target
Growth hormone secretagogue receptor type 1
Ligand
BDBM50232289
Substrate
Meas. Tech.
ChEMBL_460934 (CHEMBL944882)
IC50
140±n/a nM
Citation
 Moulin, ADemange, LRyan, JMousseaux, DSanchez, PBergé, GGagne, DPerrissoud, DLocatelli, VTorsello, AGalleyrand, JCFehrentz, JAMartinez, J New trisubstituted 1,2,4-triazole derivatives as potent ghrelin receptor antagonists. 3. Synthesis and pharmacological in vitro and in vivo evaluations. J Med Chem 51:689-93 (2008)  
Target
Name:
Growth hormone secretagogue receptor type 1
Synonyms:
GH-releasing peptide receptor GHS-R GHSR_HUMAN Ghrelin receptor | Ghrelin receptor 1a (GHS-R1a)
Type:
Receptor
Mol. Mass.:
41334.57
Organism:
Homo sapiens (Human)
Description:
Receptor binding studies use plasma membranes from LLC PK-1 cells transiently transfected with hGHSR1a.
Residue:
366
  
Inhibitor
Name:
BDBM50232289
Synonyms:
(1S,2R)-N-((R)-(5-(2-(1H-indol-3-yl)ethyl)-4-(2,4-dimethoxybenzyl)-4H-1,2,4-triazol-3-yl)(1H-indol-3-yl)methyl)-2-aminocyclohexanecarboxamide | CHEMBL400879
Type:
Small organic molecule
Emp. Form.:
C37H41N7O3
Mol. Mass.:
631.7665
SMILES:
COc1ccc(Cn2c(CCc3c[nH]c4ccccc34)nnc2[C@H](NC(=O)[C@H]2CCCC[C@H]2N)c2c[nH]c3ccccc23)c(OC)c1
: