Target
5-hydroxytryptamine receptor 6
Ligand
BDBM50169599
Substrate
Meas. Tech.
ChEMBL_461019 (CHEMBL944975)
Ki
0.3±n/a nM
Citation
 Dukat, MMosier, PDKolanos, RRoth, BLGlennon, RA Binding of serotonin and N1-benzenesulfonyltryptamine-related analogs at human 5-HT6 serotonin receptors: receptor modeling studies. J Med Chem 51:603-11 (2008)  
Target
Name:
5-hydroxytryptamine receptor 6
Synonyms:
5-HT-6 5-hydroxytryptamine receptor 6 (5-HT-6) 5-hydroxytryptamine receptor 6 (5HT6) HTR6 Serotonin 6 (5-HT6) receptor | Serotonin Receptor 6
Type:
G Protein-Coupled Receptor (GPCR)
Mol. Mass.:
46968.43
Organism:
Homo sapiens (Human)
Description:
P50406
Residue:
440
  
Inhibitor
Name:
BDBM50169599
Synonyms:
1-Benzenesulfonyl-3-((R)-1-methyl-pyrrolidin-2-ylmethyl)-1H-indole; oxalic acid CHEMBL194307
Type:
Small organic molecule
Emp. Form.:
C20H22N2O2S
Mol. Mass.:
354.466
SMILES:
CN1CCC[C@@H]1Cc1cn(c2ccccc12)S(=O)(=O)c1ccccc1
: