Target
Adenosine receptor A2b
Ligand
BDBM50233109
Substrate
Meas. Tech.
ChEMBL_462280 (CHEMBL946043)
Ki
21±n/a nM
Citation
 Kalla, RVElzein, EPerry, TLi, XGimbel, AYang, MZeng, DZablocki, J Selective, high affinity A(2B) adenosine receptor antagonists: N-1 monosubstituted 8-(pyrazol-4-yl)xanthines. Bioorg Med Chem Lett 18:1397-401 (2008)  
Target
Name:
Adenosine receptor A2b
Synonyms:
AA2BR_HUMAN ADORA2B Adenosine receptors A2b | Adenosine receptors; A2a & A2b
Type:
G Protein-Coupled Receptor (GPCR)
Mol. Mass.:
36341.22
Organism:
Homo sapiens (Human)
Description:
Residue:
332
  
Inhibitor
Name:
BDBM50233109
Synonyms:
8-(1-((5-phenyl-1,2,4-oxadiazol-3-yl)methyl)-1H-pyrazol-4-yl)-1,3-dipropyl-1H-purine-2,6(3H,7H)-dione | CHEMBL252045
Type:
Small organic molecule
Emp. Form.:
C23H24N8O3
Mol. Mass.:
460.4885
SMILES:
CCCn1c2nc([nH]c2c(=O)n(CCC)c1=O)-c1cnn(Cc2noc(n2)-c2ccccc2)c1
: