Target
Complement C1s subcomponent
Ligand
BDBM50233685
Substrate
Meas. Tech.
ChEMBL_462407 (CHEMBL927223)
Ki
460±n/a nM
Citation
 Travins, JMAli, FHuang, HBallentine, SKKhalil, EHufnagel, HRPan, WGushue, JLeonard, KBone, RFSoll, RMDesJarlais, RLCrysler, CSNinan, NKirkpatrick, JCummings, MDHuebert, NMolloy, CJGaul, MTomczuk, BESubasinghe, NL Biphenylsulfonyl-thiophene-carboxamidine inhibitors of the complement component C1s. Bioorg Med Chem Lett 18:1603-6 (2008)  
Target
Name:
Complement C1s subcomponent
Synonyms:
C1 esterase C1S_HUMAN Complement C1s subcomponent Complement C1s subcomponent light chain Trypsin | complement component 1, s subcomponent
Type:
Protein
Mol. Mass.:
76657.91
Organism:
Homo sapiens (Human)
Description:
P09871
Residue:
688
  
Inhibitor
Name:
BDBM50233685
Synonyms:
4-(2'-hydroxy-biphenyl-3-sulfonyl)-5-methylsulfanyl-thiophene-2-carboxamidine | CHEMBL252592
Type:
Small organic molecule
Emp. Form.:
C18H16N2O3S3
Mol. Mass.:
404.526
SMILES:
CSc1sc(cc1S(=O)(=O)c1cccc(c1)-c1ccccc1O)C(N)=N
: