Target
Complement C1s subcomponent
Ligand
BDBM50233688
Substrate
Meas. Tech.
ChEMBL_462407 (CHEMBL927223)
Ki
40±n/a nM
Citation
 Travins, JMAli, FHuang, HBallentine, SKKhalil, EHufnagel, HRPan, WGushue, JLeonard, KBone, RFSoll, RMDesJarlais, RLCrysler, CSNinan, NKirkpatrick, JCummings, MDHuebert, NMolloy, CJGaul, MTomczuk, BESubasinghe, NL Biphenylsulfonyl-thiophene-carboxamidine inhibitors of the complement component C1s. Bioorg Med Chem Lett 18:1603-6 (2008)  
Target
Name:
Complement C1s subcomponent
Synonyms:
C1 esterase C1S_HUMAN Complement C1s subcomponent Complement C1s subcomponent light chain Trypsin | complement component 1, s subcomponent
Type:
Protein
Mol. Mass.:
76657.91
Organism:
Homo sapiens (Human)
Description:
P09871
Residue:
688
  
Inhibitor
Name:
BDBM50233688
Synonyms:
4-(2'-chloro-biphenyl-3-sulfonyl)-5-methylsulfanyl-thiophene-2-carboxamidine | CHEMBL252998
Type:
Small organic molecule
Emp. Form.:
C18H15ClN2O2S3
Mol. Mass.:
422.972
SMILES:
CSc1sc(cc1S(=O)(=O)c1cccc(c1)-c1ccccc1Cl)C(N)=N
: