Target
Tyrosine-protein kinase receptor UFO
Ligand
BDBM27917
Substrate
Meas. Tech.
ChEMBL_462426 (CHEMBL927242)
IC50
6.4±n/a nM
Citation
 Illig, CRChen, JWall, MJWilson, KJBallentine, SKRudolph, MJDesJarlais, RLChen, YSchubert, CPetrounia, ICrysler, CSMolloy, CJChaikin, MAManthey, CLPlayer, MRTomczuk, BEMeegalla, SK Discovery of novel FMS kinase inhibitors as anti-inflammatory agents. Bioorg Med Chem Lett 18:1642-8 (2008)  
Target
Name:
Tyrosine-protein kinase receptor UFO
Synonyms:
AXL TEL/AXL UFO | UFO_HUMAN
Type:
Enzyme
Mol. Mass.:
98316.97
Organism:
Homo sapiens (Human)
Description:
P30530
Residue:
894
  
Inhibitor
Name:
BDBM27917
Synonyms:
4-cyano-N-[4-(4-methylpiperazin-1-yl)-2-(4-methylpiperidin-1-yl)phenyl]-1H-pyrrole-2-carboxamide arylamide, 8
Type:
Small organic molecule
Emp. Form.:
C23H30N6O
Mol. Mass.:
406.5239
SMILES:
CC1CCN(CC1)c1cc(ccc1NC(=O)c1cc(c[nH]1)C#N)N1CCN(C)CC1
: