Target
Neprilysin
Ligand
BDBM50411599
Substrate
Meas. Tech.
ChEMBL_462452 (CHEMBL928317)
Ki
37±n/a nM
Citation
 Deaton, DNGraham, KPGross, JWMiller, AB Thiol-based angiotensin-converting enzyme 2 inhibitors: P1' modifications for the exploration of the S1' subsite. Bioorg Med Chem Lett 18:1681-7 (2008)  
Target
Name:
Neprilysin
Synonyms:
Atriopeptidase CD_antigen=CD10 EPN MME NEP_HUMAN Neutral endopeptidase | Neutral endopeptidase 24.11
Type:
Enzyme
Mol. Mass.:
85505.38
Organism:
Homo sapiens (Human)
Description:
P08473
Residue:
750
  
Inhibitor
Name:
BDBM50411599
Synonyms:
CHEMBL254495
Type:
Small organic molecule
Emp. Form.:
C22H27NO4S
Mol. Mass.:
401.519
SMILES:
CC[C@@H](C)[C@H](S)C(=O)N[C@@H](Cc1cccc(OCc2ccccc2)c1)C(O)=O
: