Target
Neprilysin
Ligand
BDBM50411606
Substrate
Meas. Tech.
ChEMBL_462452 (CHEMBL928317)
Ki
10±n/a nM
Citation
 Deaton, DNGraham, KPGross, JWMiller, AB Thiol-based angiotensin-converting enzyme 2 inhibitors: P1' modifications for the exploration of the S1' subsite. Bioorg Med Chem Lett 18:1681-7 (2008)  
Target
Name:
Neprilysin
Synonyms:
Atriopeptidase CD_antigen=CD10 EPN MME NEP_HUMAN Neutral endopeptidase | Neutral endopeptidase 24.11
Type:
Enzyme
Mol. Mass.:
85505.38
Organism:
Homo sapiens (Human)
Description:
P08473
Residue:
750
  
Inhibitor
Name:
BDBM50411606
Synonyms:
CHEMBL254282
Type:
Small organic molecule
Emp. Form.:
C21H25NO4S
Mol. Mass.:
387.493
SMILES:
CC[C@@H](C)[C@H](S)C(=O)N[C@@H](Cc1ccc(Oc2ccccc2)cc1)C(O)=O
: