Target
Peroxisome proliferator-activated receptor gamma
Ligand
BDBM50234377
Substrate
Meas. Tech.
ChEMBL_462571 (CHEMBL928497)
Ki
48±n/a nM
Citation
 Parmenon, CGuillard, JCaignard, DHHennuyer, NStaels, BAudinot-Bouchez, VBoutin, JADacquet, CKtorza, AViaud-Massuard, MC 4,4-Dimethyl-1,2,3,4-tetrahydroquinoline-based PPARalpha/gamma agonists. Part I: synthesis and pharmacological evaluation. Bioorg Med Chem Lett 18:1617-22 (2008)  
Target
Name:
Peroxisome proliferator-activated receptor gamma
Synonyms:
NR1C3 PPAR-gamma PPARG_HUMAN Peroxisome proliferator-activated receptor gamma (PPAR gamma) Peroxisome proliferator-activated receptor gamma (PPARĪ³) peroxisome proliferator-activated receptor gamma isoform 2
Type:
Nuclear Receptor
Mol. Mass.:
57613.46
Organism:
Homo sapiens (Human)
Description:
P37231
Residue:
505
  
Inhibitor
Name:
BDBM50234377
Synonyms:
2-ethoxy-3-(4-(2-(6-((methoxyimino)(phenyl)methyl)-4,4-dimethyl-3,4-dihydroquinolin-1(2H)-yl)ethoxy)phenyl)propanoic acid | CHEMBL398677
Type:
Small organic molecule
Emp. Form.:
C32H38N2O5
Mol. Mass.:
530.6545
SMILES:
CCOC(Cc1ccc(OCCN2CCC(C)(C)c3cc(ccc23)C(=N/OC)\c2ccccc2)cc1)C(O)=O
: