Target
Autoinducer 2-binding periplasmic protein LuxP
Ligand
BDBM50234647
Substrate
Meas. Tech.
ChEMBL_462614 (CHEMBL929603)
IC50
12000±n/a nM
Citation
 Ni, NChoudhary, GLi, MWang, B Pyrogallol and its analogs can antagonize bacterial quorum sensing in Vibrio harveyi. Bioorg Med Chem Lett 18:1567-72 (2008)  
Target
Name:
Autoinducer 2-binding periplasmic protein LuxP
Synonyms:
LUXP_VIBHA | luxP
Type:
PROTEIN
Mol. Mass.:
41453.75
Organism:
Vibrio harveyi
Description:
ChEMBL_1513759
Residue:
365
  
Inhibitor
Name:
BDBM50234647
Synonyms:
3,4,5-trihydroxybenzaldehyde | CHEMBL254710
Type:
Small organic molecule
Emp. Form.:
C7H6O4
Mol. Mass.:
154.1201
SMILES:
Oc1cc(C=O)cc(O)c1O
: