Target
Autoinducer 2-binding periplasmic protein LuxP
Ligand
BDBM50031472
Substrate
Meas. Tech.
ChEMBL_462614 (CHEMBL929603)
IC50
2000±n/a nM
Citation
 Ni, NChoudhary, GLi, MWang, B Pyrogallol and its analogs can antagonize bacterial quorum sensing in Vibrio harveyi. Bioorg Med Chem Lett 18:1567-72 (2008)  
Target
Name:
Autoinducer 2-binding periplasmic protein LuxP
Synonyms:
LUXP_VIBHA | luxP
Type:
PROTEIN
Mol. Mass.:
41453.75
Organism:
Vibrio harveyi
Description:
ChEMBL_1513759
Residue:
365
  
Inhibitor
Name:
BDBM50031472
Synonyms:
1,2,3-Trihydroxybenzene, XIV Pyrogallol (10) pyrogallol
Type:
Small organic molecule
Emp. Form.:
C6H6O3
Mol. Mass.:
126.11
SMILES:
Oc1cccc(O)c1O
: