Target
Histamine H3 receptor
Ligand
BDBM50237875
Substrate
Meas. Tech.
ChEMBL_463102 (CHEMBL930008)
Ki
1.1±n/a nM
Citation
 Sasho, SSeishi, TKawamura, MHirose, RToki, SShimada, JI Diamine derivatives containing imidazolidinylidene propanedinitrile as a new class of histamine H3 receptor antagonists. Part I. Bioorg Med Chem Lett 18:2288-91 (2008)  
Target
Name:
Histamine H3 receptor
Synonyms:
HH3R Hrh3
Type:
G Protein-Coupled Receptor (GPCR)
Mol. Mass.:
48607.98
Organism:
Rattus norvegicus (rat)
Description:
Residue:
445
  
Inhibitor
Name:
BDBM50237875
Synonyms:
2-(1,3-bis(2-((R)-2-methylpyrrolidin-1-yl)ethyl)imidazolidin-2-ylidene)malononitrile | CHEMBL257607
Type:
Small organic molecule
Emp. Form.:
C20H32N6
Mol. Mass.:
356.5083
SMILES:
[#6]-[#6@@H]-1-[#6]-[#6]-[#6]-[#7]-1-[#6]-[#6]-[#7]1-[#6]-[#6]-[#7](-[#6]-[#6]-[#7]-2-[#6]-[#6]-[#6]-[#6@H]-2-[#6])\[#6]-1=[#6](/C#N)C#N
: