Target
Sucrase-isomaltase, intestinal
Ligand
BDBM50234571
Substrate
Meas. Tech.
ChEMBL_548788 (CHEMBL1025049)
IC50
11000±n/a nM
Citation
 Asano, NKato, AMiyauchi, MKizu, HKameda, YWatson, AANash, RJFleet, GW Nitrogen-containing furanose and pyranose analogues from Hyacinthus orientalis. J Nat Prod 61:625-8 (1998)  
Target
Name:
Sucrase-isomaltase, intestinal
Synonyms:
SUIS_RAT Sucrase-isomaltase | alpha-Glucosidase (α-Glucosidase)
Type:
Enzyme
Mol. Mass.:
210329.04
Organism:
Rattus norvegicus (Rat)
Description:
P23739
Residue:
1841
  
Inhibitor
Name:
BDBM50234571
Synonyms:
2,5-imino-2,5,6-trideoxy-D-manno-heptitol | CHEMBL407337
Type:
Small organic molecule
Emp. Form.:
C7H15NO4
Mol. Mass.:
177.1983
SMILES:
OCC[C@H]1N[C@H](CO)[C@@H](O)[C@@H]1O
: