Target
DNA topoisomerase 1
Ligand
BDBM50242374
Substrate
Meas. Tech.
ChEMBL_509264 (CHEMBL996008)
IC50
50000±n/a nM
Citation
 Suzuki, KYahara, SMaehata, KUyeda, M Isoaurostatin, a novel topoisomerase inhibitor produced by Thermomonospora alba. J Nat Prod 64:204-7 (2001)  
Target
Name:
DNA topoisomerase 1
Synonyms:
DNA topoisomerase I TOP1 | TOP1_HUMAN
Type:
Enzyme
Mol. Mass.:
90771.02
Organism:
Homo sapiens (Human)
Description:
P11387
Residue:
765
  
Inhibitor
Name:
BDBM50242374
Synonyms:
CHEMBL505529 | topostatin
Type:
Small organic molecule
Emp. Form.:
C36H58N4O11S
Mol. Mass.:
754.931
SMILES:
CCCCCCCC(C)CC=C(C)C=CC(=O)C(C)CCC1OC(=O)[C@H](CC(OS(O)(=O)=O)C(N)=O)NC(=O)[C@@H](C)CNC(=O)C(=C)NC(=O)C1C
: