Target
DNA topoisomerase 1
Ligand
BDBM50008923
Substrate
Meas. Tech.
ChEMBL_509261 (CHEMBL996005)
IC50
12000±n/a nM
Citation
 Suzuki, KYahara, SMaehata, KUyeda, M Isoaurostatin, a novel topoisomerase inhibitor produced by Thermomonospora alba. J Nat Prod 64:204-7 (2001)  
Target
Name:
DNA topoisomerase 1
Synonyms:
DNA topoisomerase I Top-1 | Top1
Type:
PROTEIN
Mol. Mass.:
90922.04
Organism:
Mus musculus
Description:
ChEMBL_208411
Residue:
767
  
Inhibitor
Name:
BDBM50008923
Synonyms:
(S)-4-ethyl-4-hydroxy-1,12-dihydro-4H-2-oxa-6,12a-diaza-dibenzo[b,h]florene-3,13-dione 4-Ethyl-4-hydroxy-1,12-dihydro-4H-2-oxa-6,12a-diaza-dibenzo[b,h]fluorene-3,13-dione 4-Ethyl-4-hydroxy-1,12-dihydro-4H-2-oxa-6,12a-diaza-dibenzo[b,h]fluorene-3,13-dione (Camptothecin) 4-ethyl-4-hydroxy-(4S)-3,4,12,14-tetrahydro-1H-pyrano[3',4':6,7]indolizino[1,2-b]quinoline-3,14-dione Camptothecin (CT) cid_24360
Type:
Small organic molecule
Emp. Form.:
C20H16N2O4
Mol. Mass.:
348.352
SMILES:
CC[C@@]1(O)C(=O)OCc2c1cc1-c3nc4ccccc4cc3Cn1c2=O
: