Target
Beta-mannosidase
Ligand
BDBM50234567
Substrate
Meas. Tech.
ChEMBL_486583 (CHEMBL1020977)
IC50
18000±n/a nM
Citation
 Yasuda, KKizu, HYamashita, TKameda, YKato, ANash, RJFleet, GWMolyneux, RJAsano, N New sugar-mimic alkaloids from the pods of Angylocalyx pynaertii. J Nat Prod 65:198-202 (2002)  
Target
Name:
Beta-mannosidase
Synonyms:
MANBA_RAT | Manba
Type:
PROTEIN
Mol. Mass.:
101229.60
Organism:
Rattus norvegicus
Description:
ChEMBL_41368
Residue:
881
  
Inhibitor
Name:
BDBM50234567
Synonyms:
1,4-dideoxy-1,4-imino-D-ribitol IMINORIBITOL
Type:
Small organic molecule
Emp. Form.:
C5H11NO3
Mol. Mass.:
133.1457
SMILES:
OC[C@H]1NC[C@H](O)[C@@H]1O
: