Target
Peroxisome proliferator-activated receptor gamma
Ligand
BDBM50049243
Substrate
Meas. Tech.
ChEMBL_506977 (CHEMBL938813)
EC50
14900±n/a nM
Citation
 Hwang, BYLee, JHNam, JBKim, HSHong, YSLee, JJ Two new furanoditerpenes from Saururus chinenesis and their effects on the activation of peroxisome proliferator-activated receptor gamma. J Nat Prod 65:616-7 (2002)  
Target
Name:
Peroxisome proliferator-activated receptor gamma
Synonyms:
NR1C3 PPAR-gamma PPARG_HUMAN Peroxisome proliferator-activated receptor gamma (PPAR gamma) Peroxisome proliferator-activated receptor gamma (PPARĪ³) peroxisome proliferator-activated receptor gamma isoform 2
Type:
Nuclear Receptor
Mol. Mass.:
57613.46
Organism:
Homo sapiens (Human)
Description:
P37231
Residue:
505
  
Inhibitor
Name:
BDBM50049243
Synonyms:
5-[4-(1-Methyl-cyclohexylmethoxy)-benzyl]-thiazolidine-2,4-dione 5-[4-(1-Methyl-cyclohexylmethoxy)-benzyl]-thiazolidine-2,4-dione(Ciglitazone) CIGLITAZONE | US8637558, 112
Type:
Small organic molecule
Emp. Form.:
C18H23NO3S
Mol. Mass.:
333.445
SMILES:
CC1(COc2ccc(Cc3sc(=O)[nH]c3O)cc2)CCCCC1
: