Target
Beta-galactosidase
Ligand
BDBM50279407
Substrate
Meas. Tech.
ChEMBL_545877 (CHEMBL1034392)
IC50
3400±n/a nM
Citation
 Yamashita, TYasuda, KKizu, HKameda, YWatson, AANash, RJFleet, GWAsano, N New polyhydroxylated pyrrolidine, piperidine, and pyrrolizidine alkaloids from Scilla sibirica. J Nat Prod 65:1875-81 (2002)  
Target
Name:
Beta-galactosidase
Synonyms:
β-galactosidase Beta-galactosidase/Glucosylceramidase | GLB1
Type:
Protein
Mol. Mass.:
73420.88
Organism:
Bos taurus (Bovine)
Description:
Residue:
653
  
Inhibitor
Name:
BDBM50279407
Synonyms:
2,5-Imino-2,5,7-trideoxy-D-glycero-D-manno-heptitol | CHEMBL488157
Type:
Small organic molecule
Emp. Form.:
C7H15NO4
Mol. Mass.:
177.1983
SMILES:
C[C@H](O)[C@H]1N[C@H](CO)[C@@H](O)[C@@H]1O
: