Target
Lysosomal alpha-glucosidase
Ligand
BDBM18351
Substrate
Meas. Tech.
ChEMBL_545874 (CHEMBL1034389)
IC50
400±n/a nM
Citation
 Yamashita, TYasuda, KKizu, HKameda, YWatson, AANash, RJFleet, GWAsano, N New polyhydroxylated pyrrolidine, piperidine, and pyrrolizidine alkaloids from Scilla sibirica. J Nat Prod 65:1875-81 (2002)  
Target
Name:
Lysosomal alpha-glucosidase
Synonyms:
Acidic alpha-glucosidase LYAG_RAT
Type:
PROTEIN
Mol. Mass.:
106191.24
Organism:
Rattus norvegicus
Description:
ChEMBL_1506157
Residue:
953
  
Inhibitor
Name:
BDBM18351
Synonyms:
(2R,3R,4R,5S)-2-(Hydroxymethyl)piperidine-3,4,5-triol, 10 1-Deoxynojirimycin CHEMBL307429 US9181184, 1 | dNM
Type:
natural product
Emp. Form.:
C6H13NO4
Mol. Mass.:
163.1717
SMILES:
OC[C@H]1NC[C@H](O)[C@@H](O)[C@@H]1O
: