Target
Beta-glucosidase A
Ligand
BDBM50234571
Substrate
Meas. Tech.
ChEMBL_545875 (CHEMBL1034390)
IC50
350000±n/a nM
Citation
 Yamashita, TYasuda, KKizu, HKameda, YWatson, AANash, RJFleet, GWAsano, N New polyhydroxylated pyrrolidine, piperidine, and pyrrolizidine alkaloids from Scilla sibirica. J Nat Prod 65:1875-81 (2002)  
Target
Name:
Beta-glucosidase A
Synonyms:
BGLS_CALSA | bglA
Type:
PROTEIN
Mol. Mass.:
53484.21
Organism:
Caldocellum saccharolyticum
Description:
ChEMBL_37437
Residue:
455
  
Inhibitor
Name:
BDBM50234571
Synonyms:
2,5-imino-2,5,6-trideoxy-D-manno-heptitol | CHEMBL407337
Type:
Small organic molecule
Emp. Form.:
C7H15NO4
Mol. Mass.:
177.1983
SMILES:
OCC[C@H]1N[C@H](CO)[C@@H](O)[C@@H]1O
: