Target
Estrogen receptor beta
Ligand
BDBM32073
Substrate
Meas. Tech.
ChEMBL_504036 (CHEMBL992088)
EC50
24±n/a nM
Citation
 Hellwig, VMayer-Bartschmid, AMüller, HGreif, GKleymann, GZitzmann, WTichy, HVStadler, M Pochonins A-F, new antiviral and antiparasitic resorcylic acid lactones from Pochonia chlamydosporia var. catenulata. J Nat Prod 66:829-37 (2003)  
Target
Name:
Estrogen receptor beta
Synonyms:
ER-beta ESR2_HUMAN Estradiol receptor beta (ERβ) Estrogen receptor (ER beta) Estrogen receptor beta (ER beta) NR3A2 estrogen beta
Type:
Protein
Mol. Mass.:
59238.43
Organism:
Homo sapiens (Human)
Description:
Q92731
Residue:
530
  
Inhibitor
Name:
BDBM32073
Synonyms:
(7R,11S)-11-methyl-7,15,17-tris(oxidanyl)-12-oxabicyclo[12.4.0]octadeca-1(14),15,17-trien-13-one CHEMBL450613 SMR000060050 Zearalanol | cid_2999413
Type:
Small organic molecule
Emp. Form.:
C18H26O5
Mol. Mass.:
322.396
SMILES:
C[C@H]1CCC[C@H](O)CCCCCc2cc(O)cc(O)c2C(=O)O1
: