Target
Cyclin-dependent kinase 5
Ligand
BDBM15236
Substrate
Meas. Tech.
ChEMBL_548295 (CHEMBL1028365)
EC50
71100±n/a nM
Citation
 Zapata-Torres, GOpazo, FSalgado, CMuñoz, JPKrautwurst, HMascayano, CSepúlveda-Boza, SMaccioni, RBCassels, BK Effects of natural flavones and flavonols on the kinase activity of Cdk5. J Nat Prod 67:416-20 (2004)  
Target
Name:
Cyclin-dependent kinase 5
Synonyms:
CDK5_RAT Cdkn5 PSSALRE
Type:
PROTEIN
Mol. Mass.:
33258.60
Organism:
Rattus norvegicus
Description:
ChEMBL_548295
Residue:
292
  
Inhibitor
Name:
BDBM15236
Synonyms:
3,5,7-trihydroxy-2-(3,4,5-trihydroxyphenyl)-4H-chromen-4-one CHEMBL164 Myricetin Myricetin (Myr) | cid_5281672
Type:
Small organic molecule
Emp. Form.:
C15H10O8
Mol. Mass.:
318.2351
SMILES:
Oc1cc(O)c2c(c1)oc(-c1cc(O)c(O)c(O)c1)c(O)c2=O
: