Target
Muscarinic acetylcholine receptor M5
Ligand
BDBM50241913
Substrate
Meas. Tech.
ChEMBL_550726 (CHEMBL1006040)
IC50
1640±n/a nM
Citation
 Ikeda, YNonaka, HFurumai, TOnaka, HIgarashi, Y Nocardimicins A, B, C, D, E, and F, siderophores with muscarinic M3 receptor inhibiting activity from Nocardia sp. TP-A0674. J Nat Prod 68:1061-5 (2005)  
Target
Name:
Muscarinic acetylcholine receptor M5
Synonyms:
ACM5_HUMAN | CHRM5
Type:
PROTEIN
Mol. Mass.:
60102.35
Organism:
Homo sapiens (Human)
Description:
ChEMBL_1517990
Residue:
532
  
Inhibitor
Name:
BDBM50241913
Synonyms:
CHEMBL499519 nocardimicin B
Type:
Small organic molecule
Emp. Form.:
C39H59N5O10
Mol. Mass.:
757.9133
SMILES:
CCCCCCCCCCCC(OC(=O)C(CCCCN(O)C(C)=O)NC(=O)c1coc(n1)-c1ccccc1O)C(C)C(=O)NC1CCCCN(O)C1=O
: