Target
Tyrosine-protein kinase Lck
Ligand
BDBM50045936
Substrate
Meas. Tech.
ChEMBL_526710 (CHEMBL971894)
IC50
82000±n/a nM
Citation
 McArdle, BMCampitelli, MRQuinn, RJ A common protein fold topology shared by flavonoid biosynthetic enzymes and therapeutic targets. J Nat Prod 69:14-7 (2006)  
Target
Name:
Tyrosine-protein kinase Lck
Synonyms:
2.7.10.2 LCK_HUMAN Leukocyte C-terminal Src kinase Lymphocyte-specific protein tyrosine kinase Protein YT16 Proto-oncogene tyrosine-protein kinase LCK T cell-specific protein-tyrosine kinase
Type:
Mol. Mass.:
57987.83
Organism:
Homo sapiens (Human)
Description:
P06239
Residue:
509
  
Inhibitor
Name:
BDBM50045936
Synonyms:
(E)-4-(3,5-dihydroxystyryl)benzene-1,2-diol 3,3',4,5'-tetrahydroxystilbene 3,4,3',5'-tetrahydroxystillbene 4-[(E)-2-(3,5-dihydroxyphenyl)vinyl]benzene-1,2-diol 4-[2-(3,5-dihydroxyphenyl)-(E)-1-ethenyl]-1,2-benzenediol CHEMBL69863 US11866416, Example 8 piceatanol | trans-3,3',4,5'-tetrahydroxystilbene
Type:
Small organic molecule
Emp. Form.:
C14H12O4
Mol. Mass.:
244.2427
SMILES:
Oc1cc(O)cc(\C=C\c2ccc(O)c(O)c2)c1
: