Target
Cyclin-dependent kinase 7
Ligand
BDBM50269948
Substrate
Meas. Tech.
ChEMBL_505238 (CHEMBL941345)
IC50
197±n/a nM
Citation
 Slack-Davis, JKMartin, KHTilghman, RWIwanicki, MUng, EJAutry, CLuzzio, MJCooper, BKath, JCRoberts, WGParsons, JT Cellular characterization of a novel focal adhesion kinase inhibitor. J Biol Chem 282:14845-52 (2007)  
Target
Name:
Cyclin-dependent kinase 7
Synonyms:
39 kDa protein kinase CAK1 CDK-activating kinase 1 (CAK) CDK7_HUMAN Cell division protein kinase 7 Cyclin-dependent kinase 7 (CDK7/cyclin H) P39 Mo15 TFIIH basal transcription factor complex kinase subunit
Type:
Enzyme Subunit
Mol. Mass.:
39047.01
Organism:
Homo sapiens (Human)
Description:
Residue:
346
  
Inhibitor
Name:
BDBM50269948
Synonyms:
6-(4-(3-(methylsulfonyl)benzylamino)-5-(trifluoromethyl)pyrimidin-2-ylamino)-3,4-dihydroquinolin-2(1H)-one D3RKN_2 US10266549, Example 32 | US10774092, Example 32
Type:
Small organic molecule
Emp. Form.:
C22H20F3N5O3S
Mol. Mass.:
491.486
SMILES:
CS(=O)(=O)c1cccc(CNc2nc(Nc3ccc4NC(=O)CCc4c3)ncc2C(F)(F)F)c1
: