Target
Parathyroid hormone/parathyroid hormone-related peptide receptor
Ligand
BDBM50269977
Substrate
Meas. Tech.
ChEMBL_505703 (CHEMBL944465)
IC50
98.2±n/a nM
Citation
 Carter, PHLiu, RQFoster, WRTamasi, JATebben, AJFavata, MStaal, ACvijic, MEFrench, MHDell, VApanovitch, DLei, MZhao, QCunningham, MDecicco, CPTrzaskos, JMFeyen, JH Discovery of a small molecule antagonist of the parathyroid hormone receptor by using an N-terminal parathyroid hormone peptide probe. Proc Natl Acad Sci U S A 104:6846-51 (2007)  
Target
Name:
Parathyroid hormone/parathyroid hormone-related peptide receptor
Synonyms:
PTH/PTHr receptor PTH1 receptor PTH1R_HUMAN PTHR1 Parathyroid hormone receptor
Type:
Enzyme Catalytic Domain
Mol. Mass.:
66370.95
Organism:
Homo sapiens (Human)
Description:
PARATHYROID HT1 0 HUMAN::Q03431
Residue:
593
  
Inhibitor
Name:
BDBM50269977
Synonyms:
Aib-Val-Aib-Glu-lle-Gln-Leu-Nle-His-Gln-Arg-Ala-Lys-Tyr-Fly | CHEMBL525069
Type:
Small organic molecule
Emp. Form.:
C102H149N25O24
Mol. Mass.:
2109.4276
SMILES:
CCCC[C@H](NC(=O)[C@H](CC(C)C)NC(=O)[C@H](CCC(N)=O)NC(=O)[C@@H](NC(=O)[C@H](CCC(O)=O)NC(=O)C(C)(C)NC(=O)[C@@H](NC(=O)C(C)(C)N)C(C)C)[C@@H](C)CC)C(=O)N[C@@H](Cc1cnc[nH]1)C(=O)N[C@@H](CCC(N)=O)C(=O)N[C@@H](CCCN=C(N)N)C(=O)N[C@@H](C)C(=O)N[C@@H](CCCCN)C(=O)N[C@@H](Cc1ccc(O)cc1)C(=O)N[C@@H](CCCCNC(=O)c1ccccc1-c1c2ccc(O)cc2oc2cc(=O)ccc12)C(N)=O
: