Target
Alpha-2C adrenergic receptor
Ligand
BDBM50269979
Substrate
Meas. Tech.
ChEMBL_505748 (CHEMBL945454)
IC50
10400±n/a nM
Citation
 Carter, PHLiu, RQFoster, WRTamasi, JATebben, AJFavata, MStaal, ACvijic, MEFrench, MHDell, VApanovitch, DLei, MZhao, QCunningham, MDecicco, CPTrzaskos, JMFeyen, JH Discovery of a small molecule antagonist of the parathyroid hormone receptor by using an N-terminal parathyroid hormone peptide probe. Proc Natl Acad Sci U S A 104:6846-51 (2007)  
Target
Name:
Alpha-2C adrenergic receptor
Synonyms:
ADA2C_HUMAN ADRA2L2 Adrenergic alpha2C Adrenergic receptor alpha Alpha-2 adrenergic receptor subtype C4 Alpha-2C adrenoreceptor | adrenergic, alpha-2C-, receptor [Homo sapiens]
Type:
Enzyme
Mol. Mass.:
49552.32
Organism:
Homo sapiens (Human)
Description:
P18825
Residue:
462
  
Inhibitor
Name:
BDBM50269979
Synonyms:
CHEMBL515170 | r-5-(2-E-cyclopropylvinyl)-t-3-ethyl-6,7-difluoro-5-(trifluoromethyl)benzo[e][1,4]-oxazepin-2(1H,3H,5H)-one
Type:
Small organic molecule
Emp. Form.:
C17H16F5NO2
Mol. Mass.:
361.3065
SMILES:
CC[C@@H]1O[C@@](\C=C\C2CC2)(c2c(F)c(F)ccc2NC1=O)C(F)(F)F
: