Target
Cannabinoid receptor 1
Ligand
BDBM50251194
Substrate
Meas. Tech.
ChEMBL_531309 (CHEMBL989721)
IC50
250±n/a nM
Citation
 Moloney, GPAngus, JARobertson, ADStoermer, MJRobinson, MWright, CEMcRae, KChristopoulos, A Synthesis and cannabinoid activity of 1-substituted-indole-3-oxadiazole derivatives: novel agonists for the CB1 receptor. Eur J Med Chem 43:513-39 (2008)  
Target
Name:
Cannabinoid receptor 1
Synonyms:
Brain-type cannabinoid receptor CB-R CNR1_RAT Cannabinoid receptor Cnr1 | Skr6
Type:
G Protein-Coupled Receptor (GPCR)
Mol. Mass.:
52856.55
Organism:
Rattus norvegicus (rat)
Description:
P20272
Residue:
473
  
Inhibitor
Name:
BDBM50251194
Synonyms:
4-(2-(3-(3-Phenyl-1,2,4-oxadiazol-5-yl)-1H-indol-1-yl)-ethyl)morpholine | CHEMBL514909
Type:
Small organic molecule
Emp. Form.:
C22H22N4O2
Mol. Mass.:
374.4357
SMILES:
C(Cn1cc(-c2nc(no2)-c2ccccc2)c2ccccc12)N1CCOCC1
: