Target
Xanthine dehydrogenase/oxidase
Ligand
BDBM50242780
Substrate
Meas. Tech.
ChEMBL_532316 (CHEMBL973239)
IC50
18440±n/a nM
Citation
 Gupta, SRodrigues, LMEsteves, APOliveira-Campos, AMNascimento, MSNazareth, NCidade, HNeves, MPFernandes, EPinto, MCerqueira, NMBrás, N Synthesis of N-aryl-5-amino-4-cyanopyrazole derivatives as potent xanthine oxidase inhibitors. Eur J Med Chem 43:771-80 (2008)  
Target
Name:
Xanthine dehydrogenase/oxidase
Synonyms:
XD XDHA XO Xanthine dehydrogenase/oxidase | Xanthine oxidase
Type:
Enzyme
Mol. Mass.:
146441.21
Organism:
Homo sapiens (Human)
Description:
P47989
Residue:
1333
  
Inhibitor
Name:
BDBM50242780
Synonyms:
CHEMBL508899 | N-(4''-Carboxyphenyl)-N-(2',3',4',6'-tetra-O-acetyl-beta-D-glucopyranosyl)pyrazolo[3,4-d] pyrimidine
Type:
Small organic molecule
Emp. Form.:
C26H27N5O11
Mol. Mass.:
585.5195
SMILES:
CC(=O)OC[C@H]1O[C@@H](Nc2ncnc3n(ncc23)-c2ccc(cc2)C(O)=O)[C@H](OC(C)=O)[C@@H](OC(C)=O)[C@@H]1OC(C)=O
: