Target
Protein kinase C iota type
Ligand
BDBM50229961
Substrate
Meas. Tech.
ChEMBL_533620 (CHEMBL966813)
IC50
>100000±n/a nM
Citation
 Qi, ZHSong, MWallace, MJWang, DNewton, PMMcMahon, TChou, WHZhang, CShokat, KMMessing, RO Protein kinase C epsilon regulates gamma-aminobutyrate type A receptor sensitivity to ethanol and benzodiazepines through phosphorylation of gamma2 subunits. J Biol Chem 282:33052-63 (2007)  
Target
Name:
Protein kinase C iota type
Synonyms:
Atypical protein kinase C-lambda/iota KPCI_HUMAN PRKCI Protein kinase C iota Protein kinase C iota type aPKC-lambda/iota | nPKC-iota
Type:
Enzyme
Mol. Mass.:
68251.56
Organism:
Homo sapiens (Human)
Description:
P41743
Residue:
596
  
Inhibitor
Name:
BDBM50229961
Synonyms:
1-(1,1-dimethylethyl)-3-(1-naphthalenyl)-1H-pyrazolo[3,4-d]pyrimidin-4-amine 1-NA-PP1 1-tert-butyl-3-naphthalen-1-yl-1H-pyrazolo[3,4-d]pyrimidin-4-amine CHEMBL264406 US11247972, Compound 1 | US9765037, Compound 1
Type:
Small organic molecule
Emp. Form.:
C19H19N5
Mol. Mass.:
317.3877
SMILES:
CC(C)(C)n1nc(-c2cccc3ccccc23)c2c(N)ncnc12
: