Target
cGMP-dependent protein kinase
Ligand
BDBM50265419
Substrate
Meas. Tech.
ChEMBL_496992 (CHEMBL1005407)
IC50
0.065±n/a nM
Citation
 Scribner, ADennis, RLee, SOuvry, GPerrey, DFisher, MWyvratt, MLeavitt, PLiberator, PGurnett, ABrown, CMathew, JThompson, DSchmatz, DBiftu, T Synthesis and biological activity of imidazopyridine anticoccidial agents: Part II. Eur J Med Chem 43:1123-51 (2008)  
Target
Name:
cGMP-dependent protein kinase
Synonyms:
Type:
PROTEIN
Mol. Mass.:
112911.27
Organism:
Eimeria tenella
Description:
ChEMBL_469577
Residue:
1003
  
Inhibitor
Name:
BDBM50265419
Synonyms:
4-[7-(1-Dimethylaminobutyl)-2-(4-fluorophenyl)imidazo[ 1,2-a]pyridin-3-yl]pyrimidin-2-ylamine | CHEMBL496559
Type:
Small organic molecule
Emp. Form.:
C23H25FN6
Mol. Mass.:
404.4832
SMILES:
CCCC(N(C)C)c1ccn2c(c(nc2c1)-c1ccc(F)cc1)-c1ccnc(N)n1
: