Target
Cyclin-dependent kinase 2
Ligand
BDBM7152
Substrate
Meas. Tech.
ChEMBL_519498 (CHEMBL951804)
IC50
>10000±n/a nM
Citation
 Mascarenhas, NMGhoshal, N An efficient tool for identifying inhibitors based on 3D-QSAR and docking using feature-shape pharmacophore of biologically active conformation--a case study with CDK2/cyclinA. Eur J Med Chem 43:2807-18 (2008)  
Target
Name:
Cyclin-dependent kinase 2
Synonyms:
CDK2 CDK2_HUMAN Cell division protein kinase 2 Protein cereblon/Cyclin-dependent kinase 2 | p33 protein kinase
Type:
Enzyme Subunit
Mol. Mass.:
33938.17
Organism:
Homo sapiens (Human)
Description:
P24941
Residue:
298
  
Inhibitor
Name:
BDBM7152
Synonyms:
3-Benzamidoaminopyrazole deriv. 29 N-(5-Benzyl-1H-pyrazol-3-yl)-4-bromobenzamide
Type:
Small organic molecule
Emp. Form.:
C17H14BrN3O
Mol. Mass.:
356.217
SMILES:
Brc1ccc(cc1)C(=O)Nc1cc(Cc2ccccc2)[nH]n1
: