Target
Nuclear receptor subfamily 1 group I member 2
Ligand
BDBM50251110
Substrate
Meas. Tech.
ChEMBL_529970 (CHEMBL975041)
EC50
55±n/a nM
Citation
 Benod, CSubra, GNahoum, VMallavialle, AGuichou, JFMilhau, JRoblés, SBourguet, WPascussi, JMBalaguer, PChavanieu, A N-1H-benzimidazol-5-ylbenzenesulfonamide derivatives as potent hPXR agonists. Bioorg Med Chem 16:3537-49 (2008)  
Target
Name:
Nuclear receptor subfamily 1 group I member 2
Synonyms:
NR1I2 Orphan nuclear receptor PAR1 PXR SXR nuclear receptor subfamily 1 group I member 2 isoform 1
Type:
Nuclear receptor
Mol. Mass.:
49774.77
Organism:
Homo sapiens (Human)
Description:
O75469
Residue:
434
  
Inhibitor
Name:
BDBM50251110
Synonyms:
2,3,4,5,6-pentamethyl-N-(1-(naphthalen-2-yl)-1H-benzo[d]imidazol-5-yl)benzenesulfonamide | CHEMBL514896
Type:
Small organic molecule
Emp. Form.:
C28H27N3O2S
Mol. Mass.:
469.598
SMILES:
Cc1c(C)c(C)c(c(C)c1C)S(=O)(=O)Nc1ccc2n(cnc2c1)-c1ccc2ccccc2c1
: