Target
Nuclear receptor subfamily 1 group I member 2
Ligand
BDBM50251081
Substrate
Meas. Tech.
ChEMBL_529970 (CHEMBL975041)
EC50
20±n/a nM
Citation
 Benod, CSubra, GNahoum, VMallavialle, AGuichou, JFMilhau, JRoblés, SBourguet, WPascussi, JMBalaguer, PChavanieu, A N-1H-benzimidazol-5-ylbenzenesulfonamide derivatives as potent hPXR agonists. Bioorg Med Chem 16:3537-49 (2008)  
Target
Name:
Nuclear receptor subfamily 1 group I member 2
Synonyms:
NR1I2 Orphan nuclear receptor PAR1 PXR SXR nuclear receptor subfamily 1 group I member 2 isoform 1
Type:
Nuclear receptor
Mol. Mass.:
49774.77
Organism:
Homo sapiens (Human)
Description:
O75469
Residue:
434
  
Inhibitor
Name:
BDBM50251081
Synonyms:
CHEMBL464867 | N-(1-benzyl-1H-benzo[d]imidazol-5-yl)-2-bromobenzenesulfonamide
Type:
Small organic molecule
Emp. Form.:
C20H16BrN3O2S
Mol. Mass.:
442.329
SMILES:
Brc1ccccc1S(=O)(=O)Nc1ccc2n(Cc3ccccc3)cnc2c1
: