Target
Chitinase B
Ligand
BDBM10854
Substrate
Meas. Tech.
ChEMBL_529989 (CHEMBL975905)
IC50
3.4±n/a nM
Citation
 Gouda, HYanai, YSugawara, ASunazuka, TOmura, SHirono, S Computational analysis of the binding affinities of the natural-product cyclopentapeptides argifin and argadin to chitinase B from Serratia marcescens. Bioorg Med Chem 16:3565-79 (2008)  
Target
Name:
Chitinase B
Synonyms:
CHIB_SERMA | chiB
Type:
Enzyme
Mol. Mass.:
55462.70
Organism:
Serratia marcescens
Description:
P11797
Residue:
499
  
Inhibitor
Name:
BDBM10854
Synonyms:
4-[(1S,4R,10S,13S,16S,18R)-10-{3-[(acetamidomethanimidoyl)amino]propyl}-18-hydroxy-16-(1H-imidazol-4-ylmethyl)-3,9,12,15,20-pentaoxo-2,8,11,14,17-pentaazatricyclo[15.2.1.0^{4,8}]icosan-13-yl]butanoic acid CHEMBL445236
Type:
Small organic molecule
Emp. Form.:
C29H42N10O9
Mol. Mass.:
674.7054
SMILES:
CC(=O)NC(=N)NCCC[C@@H]1NC(=O)[C@H](CCCC(O)=O)NC(=O)[C@H](Cc2cnc[nH]2)N2[C@H](O)C[C@H](NC(=O)[C@H]3CCCN3C1=O)C2=O
: