Target
Peroxisome proliferator-activated receptor alpha
Ligand
BDBM50266550
Substrate
Meas. Tech.
ChEMBL_544081 (CHEMBL1019541)
EC50
1±n/a nM
Citation
 Yu, JTang, LYang, YJi, R Synthesis and evaluation of a series of benzopyran derivatives as PPAR alpha/gamma agonists. Eur J Med Chem 43:2428-35 (2008)  
Target
Name:
Peroxisome proliferator-activated receptor alpha
Synonyms:
NR1C1 PPAR PPAR-alpha PPARA_HUMAN Peroxisome proliferator-activated receptor | Peroxisome proliferator-activated receptor alpha (PPAR alpha)
Type:
Enzyme
Mol. Mass.:
52222.08
Organism:
Homo sapiens (Human)
Description:
Q07869
Residue:
468
  
Inhibitor
Name:
BDBM50266550
Synonyms:
CHEMBL456912 | Methyl 7-(2-(5-methyl-2-p-tolyloxazol-4-yl)ethoxy)-2-oxo-2H-chromene-3-carboxylate
Type:
Small organic molecule
Emp. Form.:
C24H21NO6
Mol. Mass.:
419.4266
SMILES:
COC(=O)c1cc2ccc(OCCc3nc(oc3C)-c3ccc(C)cc3)cc2oc1=O
: