Target
Proto-oncogene tyrosine-protein kinase Src
Ligand
BDBM50145411
Substrate
Meas. Tech.
ChEMBL_518627 (CHEMBL962772)
Ki
2900±n/a nM
Citation
 Schenone, SBrullo, CBruno, OBondavalli, FMosti, LMaga, GCrespan, ECarraro, FManetti, FTintori, CBotta, M Synthesis, biological evaluation and docking studies of 4-amino substituted 1H-pyrazolo[3,4-d]pyrimidines. Eur J Med Chem 43:2665-76 (2008)  
Target
Name:
Proto-oncogene tyrosine-protein kinase Src
Synonyms:
Calmodulin/Proto-oncogene tyrosine-protein kinase Src Proto-oncogene c-Src SRC SRC_HUMAN V-src sarcoma (Schmidt-Ruppin A-2) viral oncogene homolog (avian) p60-Src | pp60c-src
Type:
Protein
Mol. Mass.:
59838.60
Organism:
Homo sapiens (Human)
Description:
P12931
Residue:
536
  
Inhibitor
Name:
BDBM50145411
Synonyms:
1-(2-chloro-2-phenylethyl)-6-(methylthio)-N-propyl-1H-pyrazolo[3,4-d]pyrimidin-4-amine [1-(2-Chloro-2-phenyl-ethyl)-6-methylsulfanyl-1H-pyrazolo[3,4-d]pyrimidin-4-yl]-propyl-amine
Type:
Small organic molecule
Emp. Form.:
C17H20ClN5S
Mol. Mass.:
361.892
SMILES:
CCCNc1nc(SC)nc2n(CC(Cl)c3ccccc3)ncc12
: