Target
Cannabinoid receptor 1
Ligand
BDBM50247429
Substrate
Meas. Tech.
ChEMBL_518637 (CHEMBL962782)
Ki
1100±n/a nM
Citation
 Menozzi, GFossa, PCichero, ESpallarossa, ARanise, AMosti, L Rational design, synthesis and biological evaluation of new 1,5-diarylpyrazole derivatives as CB1 receptor antagonists, structurally related to rimonabant. Eur J Med Chem 43:2627-38 (2008)  
Target
Name:
Cannabinoid receptor 1
Synonyms:
CANN6 CB-R CNR CNR1_HUMAN Cannabinoid receptor Cannabinoid receptor 1 (brain)
Type:
G Protein-Coupled Receptor (GPCR)
Mol. Mass.:
52868.96
Organism:
Homo sapiens (Human)
Description:
P21554
Residue:
472
  
Inhibitor
Name:
BDBM50247429
Synonyms:
5-(4-Bromophenyl)-N-cycloheptyl-1-(2,4-dichlorophenyl)-1H-pyrazole-4-carboxamide | CHEMBL518505
Type:
Small organic molecule
Emp. Form.:
C23H22BrCl2N3O
Mol. Mass.:
507.25
SMILES:
Clc1ccc(c(Cl)c1)-n1ncc(C(=O)NC2CCCCCC2)c1-c1ccc(Br)cc1
: