Target
Muscarinic acetylcholine receptor M1
Ligand
BDBM50260414
Substrate
Meas. Tech.
ChEMBL_530127 (CHEMBL969250)
Ki
4000±n/a nM
Citation
 Kumar, YCMalviya, MChandra, JNSadashiva, CTKumar, CSPrasad, SBPrasanna, DSSubhash, MNRangappa, KS Effect of novel N-aryl sulfonamide substituted 3-morpholino arecoline derivatives as muscarinic receptor 1 agonists in Alzheimer's dementia models. Bioorg Med Chem 16:5157-63 (2008)  
Target
Name:
Muscarinic acetylcholine receptor M1
Synonyms:
ACM1_RAT Chrm-1 cholinergic receptor, muscarinic 1
Type:
Enzyme Catalytic Domain
Mol. Mass.:
51390.46
Organism:
RAT
Description:
P08482
Residue:
460
  
Inhibitor
Name:
BDBM50260414
Synonyms:
4-(4-tert-Butyl-benzenesulfonyl)-2-(1-methyl-1,2,5,6-tetrahydro-pyridin-3-yl)-morpholine | CHEMBL495401
Type:
Small organic molecule
Emp. Form.:
C20H30N2O3S
Mol. Mass.:
378.529
SMILES:
CN1CCC=C(C1)C1CN(CCO1)S(=O)(=O)c1ccc(cc1)C(C)(C)C
: