Target
Alpha-1A adrenergic receptor
Ligand
BDBM50118705
Substrate
Meas. Tech.
ChEMBL_530278 (CHEMBL979545)
EC50
60±n/a nM
Citation
 Jain, KSBariwal, JBKathiravan, MKPhoujdar, MSSahne, RSChauhan, BSShah, AKYadav, MR Recent advances in selective alpha1-adrenoreceptor antagonists as antihypertensive agents. Bioorg Med Chem 16:4759-800 (2008)  
Target
Name:
Alpha-1A adrenergic receptor
Synonyms:
ADA1A_RABIT ADRA1C | adrenergic Alpha1
Type:
Enzyme Catalytic Domain
Mol. Mass.:
51390.87
Organism:
RABBIT
Description:
adrenergic Alpha1 0 RABBIT::O02824
Residue:
466
  
Inhibitor
Name:
BDBM50118705
Synonyms:
ABT-866 Ethanesulfonic acid [3-(1H-imidazol-4-ylmethyl)-phenyl]-amide N-[3-(1H-imidazol-4-ylmethyl)-phenyl]ethanesulfonamide
Type:
Small organic molecule
Emp. Form.:
C12H15N3O2S
Mol. Mass.:
265.331
SMILES:
CCS(=O)(=O)Nc1cccc(Cc2cnc[nH]2)c1
: