Target
Melanocortin receptor 4
Ligand
BDBM50261230
Substrate
Meas. Tech.
ChEMBL_533293 (CHEMBL973312)
Ki
3.3±n/a nM
Citation
 Chen, CTucci, FCJiang, WTran, JAFleck, BAHoare, SRWen, JChen, TJohns, MMarkison, SFoster, ACMarinkovic, DChen, CWArellano, MHarman, JSaunders, JBozigian, HMarks, D Pharmacological and pharmacokinetic characterization of 2-piperazine-alpha-isopropyl benzylamine derivatives as melanocortin-4 receptor antagonists. Bioorg Med Chem 16:5606-18 (2008)  
Target
Name:
Melanocortin receptor 4
Synonyms:
MC4-R MC4R_HUMAN Melanocortin receptor 4 (MC-4) Melanocortin receptor 4 (MC4R)
Type:
Enzyme
Mol. Mass.:
36949.50
Organism:
Homo sapiens (Human)
Description:
P32245
Residue:
332
  
Inhibitor
Name:
BDBM50261230
Synonyms:
1-{2-[(1S)-(3-Dimethylaminopropionamino)-2-methylpropyl]-4-chlorophenyl}-4-[(2R)-methyl-3-(4-chlorophenyl)propionyl]piperazine | CHEMBL467588
Type:
Small organic molecule
Emp. Form.:
C29H40Cl2N4O2
Mol. Mass.:
547.56
SMILES:
CC(C)[C@H](NC(=O)CCN(C)C)c1cc(Cl)ccc1N1CCN(CC1)C(=O)[C@H](C)Cc1ccc(Cl)cc1
: