Target
Melanocortin receptor 4
Ligand
BDBM50261196
Substrate
Meas. Tech.
ChEMBL_533294 (CHEMBL976122)
IC50
42±n/a nM
Citation
 Chen, CTucci, FCJiang, WTran, JAFleck, BAHoare, SRWen, JChen, TJohns, MMarkison, SFoster, ACMarinkovic, DChen, CWArellano, MHarman, JSaunders, JBozigian, HMarks, D Pharmacological and pharmacokinetic characterization of 2-piperazine-alpha-isopropyl benzylamine derivatives as melanocortin-4 receptor antagonists. Bioorg Med Chem 16:5606-18 (2008)  
Target
Name:
Melanocortin receptor 4
Synonyms:
MC4-R MC4R_HUMAN Melanocortin receptor 4 (MC-4) Melanocortin receptor 4 (MC4R)
Type:
Enzyme
Mol. Mass.:
36949.50
Organism:
Homo sapiens (Human)
Description:
P32245
Residue:
332
  
Inhibitor
Name:
BDBM50261196
Synonyms:
1-{2-[(1S)-(3-Azetidinylcarboxamido)-2-methylpropyl]-6-fluorophenyl}-4-[(2R)-methyl-3-(2-methoxy-4-chlorophenyl)propionyl]piperazine | CHEMBL521715
Type:
Small organic molecule
Emp. Form.:
C29H38ClFN4O3
Mol. Mass.:
545.088
SMILES:
COc1cc(Cl)ccc1C[C@@H](C)C(=O)N1CCN(CC1)c1c(F)cccc1[C@@H](NC(=O)C1CNC1)C(C)C
: