Target
11-beta-hydroxysteroid dehydrogenase type 2
Ligand
BDBM50260909
Substrate
Meas. Tech.
ChEMBL_552257 (CHEMBL995587)
IC50
>4000±n/a nM
Citation
 Zhu, YOlson, SHHermanowski-Vosatka, AMundt, SShah, KSpringer, MThieringer, RWright, SXiao, JZokian, HBalkovec, JM 4-Methyl-5-phenyl triazoles as selective inhibitors of 11beta-hydroxysteroid dehydrogenase type I. Bioorg Med Chem Lett 18:3405-11 (2008)  
Target
Name:
11-beta-hydroxysteroid dehydrogenase type 2
Synonyms:
11-DH2 11-beta-Hydroxysteroid Dehydrogenase 2 (11-beta-HSD2) Corticosteroid 11-beta-dehydrogenase isozyme 2 Hsd11b2 NAD-dependent 11-beta-hydroxysteroid dehydrogenase
Type:
Enzyme
Mol. Mass.:
42201.46
Organism:
Mus musculus (mouse)
Description:
Purified recombinant mouse 11beta-HSD2.
Residue:
386
  
Inhibitor
Name:
BDBM50260909
Synonyms:
1-(3-chloro-4-(5-(1-(4-chlorophenyl)cyclobutyl)-4-methyl-4H-1,2,4-triazol-3-yl)phenyl)-2-methyl-1H-benzo[d]imidazole | CHEMBL494822
Type:
Small organic molecule
Emp. Form.:
C27H23Cl2N5
Mol. Mass.:
488.411
SMILES:
Cc1nc2ccccc2n1-c1ccc(-c2nnc(n2C)C2(CCC2)c2ccc(Cl)cc2)c(Cl)c1
: